Target
Neuronal acetylcholine receptor subunit alpha-7
Ligand
BDBM50194069
Substrate
Meas. Tech.
ChEMBL_424281 (CHEMBL908433)
Ki
1600±n/a nM
Citation
 White, RMalpass, JRHanda, SRichard Baker, SBroad, LMFolly, LMogg, A Epibatidine isomers and analogues: structure-activity relationships. Bioorg Med Chem Lett 16:5493-7 (2006)  
Target
Name:
Neuronal acetylcholine receptor subunit alpha-7
Synonyms:
ACHA7_RAT Cholinergic, Nicotinic Alpha7 Chrna7 Neuronal acetylcholine receptor (alpha7 nAChR) Neuronal acetylcholine receptor subunit alpha-7 Neuronal acetylcholine receptor subunit alpha-7 (nAChR)
Type:
Enzyme
Mol. Mass.:
56502.44
Organism:
Rattus norvegicus (Rat)
Description:
Q05941
Residue:
502
  
Inhibitor
Name:
BDBM50194069
Synonyms:
2-(6-chloropyridin-3-yl)-6-aza-bicyclo[2.2.1]heptane CHEMBL185667
Type:
Small organic molecule
Emp. Form.:
C11H13ClN2
Mol. Mass.:
208.687
SMILES:
Clc1ccc(cn1)C1CC2CNC1C2
: