Target
Neuronal acetylcholine receptor subunit alpha-4/beta-2
Ligand
BDBM50194071
Substrate
Meas. Tech.
ChEMBL_424275 (CHEMBL908427)
Ki
1.23±n/a nM
Citation
 White, RMalpass, JRHanda, SRichard Baker, SBroad, LMFolly, LMogg, A Epibatidine isomers and analogues: structure-activity relationships. Bioorg Med Chem Lett 16:5493-7 (2006)  
Target
Name:
Neuronal acetylcholine receptor subunit alpha-4/beta-2
Synonyms:
Neuronal acetylcholine receptor Alpha-4/Beta-2 Neuronal acetylcholine receptor; alpha4/beta2 | nAChR subtypes alpha4 beta2
Type:
Protein
Mol. Mass.:
Description:
Components:
This complex has 2 components.
Component 1
Name:
Neuronal acetylcholine receptor subunit alpha-4
Synonyms:
ACHA4_HUMAN CHRNA4 protein Neuronal acetylcholine receptor protein alpha-4 subunit Nicotinic acetylcholine receptor alpha4/beta2/alpha5
Type:
Mol. Mass.:
69963.49
Organism:
Homo sapiens (Human)
Description:
NACHRA4
Residue:
627
  
Component 2
Name:
Neuronal acetylcholine receptor subunit beta-2
Synonyms:
ACHB2_HUMAN Neuronal acetylcholine receptor protein beta-2 subunit | Nicotinic acetylcholine receptor alpha3/beta2/alpha5
Type:
Protein
Mol. Mass.:
57020.50
Organism:
Homo sapiens (Human)
Description:
P17787
Residue:
502
  
Inhibitor
Name:
BDBM50194071
Synonyms:
3-(6-chloropyridin-3-yl)-6-aza-bicyclo[2.2.1]heptane CHEMBL363973
Type:
Small organic molecule
Emp. Form.:
C11H13ClN2
Mol. Mass.:
208.687
SMILES:
Clc1ccc(cn1)C1CC2CC1CN2
: