Target
UDP-N-acetylglucosamine 1-carboxyvinyltransferase
Ligand
BDBM50411242
Substrate
Meas. Tech.
ChEMBL_424365 (CHEMBL911296)
IC50
>50000±n/a nM
Citation
 Bachelier, AMayer, RKlein, CD Sesquiterpene lactones are potent and irreversible inhibitors of the antibacterial target enzyme MurA. Bioorg Med Chem Lett 16:5605-9 (2006)  
Target
Name:
UDP-N-acetylglucosamine 1-carboxyvinyltransferase
Synonyms:
EPT MURA_ECOLI UDP-N-acetylglucosamine 1-carboxyvinyltransferase murA | murZ
Type:
Protein
Mol. Mass.:
44814.62
Organism:
Escherichia coli K-12 (Enterobacteria)
Description:
E. coli MurA
Residue:
419
  
Inhibitor
Name:
BDBM50411242
Synonyms:
CHEMBL86416
Type:
Small organic molecule
Emp. Form.:
C15H20O2
Mol. Mass.:
232.3181
SMILES:
C\C1=C/CC\C(C)=C\[C@H]2OC(=O)C(=C)[C@@H]2CC1
: