Target
RmtA
Ligand
BDBM50206439
Substrate
Meas. Tech.
ChEMBL_428528 (CHEMBL919885)
IC50
1080000±n/a nM
Citation
 Ragno, RSimeoni, SCastellano, SVicidomini, CMai, ACaroli, ATramontano, ABonaccini, CTrojer, PBauer, IBrosch, GSbardella, G Small molecule inhibitors of histone arginine methyltransferases: homology modeling, molecular docking, binding mode analysis, and biological evaluations. J Med Chem 50:1241-53 (2007)  
Target
Name:
RmtA
Synonyms:
Type:
PROTEIN
Mol. Mass.:
39351.26
Organism:
Emericella nidulans
Description:
ChEMBL_475539
Residue:
345
  
Inhibitor
Name:
BDBM50206439
Synonyms:
4-hydroxy-7-(3-phenylureido)naphthalene-2-sulfonic acid | CHEMBL219678
Type:
Small organic molecule
Emp. Form.:
C17H14N2O5S
Mol. Mass.:
358.368
SMILES:
Oc1cc(cc2cc(NC(=O)Nc3ccccc3)ccc12)S(O)(=O)=O
: