Target
ATP-dependent translocase ABCB1
Ligand
BDBM50207920
Substrate
Meas. Tech.
ChEMBL_429163 (CHEMBL914418)
EC50
137±n/a nM
Citation
 Kaiser, DTerfloth, LKopp, SSchulz, Jde Laet, RChiba, PEcker, GFGasteiger, J Self-organizing maps for identification of new inhibitors of P-glycoprotein. J Med Chem 50:1698-702 (2007)  
Target
Name:
ATP-dependent translocase ABCB1
Synonyms:
ABCB1 MDR1_HUMAN Multidrug resistance protein 1 P-glycoprotein (P-gp) PGY1
Type:
Protein
Mol. Mass.:
141503.50
Organism:
Homo sapiens (Human)
Description:
P08183
Residue:
1280
  
Inhibitor
Name:
BDBM50207920
Synonyms:
1-(3-(3-(4-(2,3-dimethylphenyl)piperazin-1-yl)-2-hydroxypropoxy)phenyl)-3-phenylpropan-1-one | CHEMBL223537
Type:
Small organic molecule
Emp. Form.:
C30H36N2O3
Mol. Mass.:
472.6184
SMILES:
Cc1cccc(N2CCN(CC(O)COc3cccc(c3)C(=O)CCc3ccccc3)CC2)c1C
: