Target
Adenosine receptor A2a
Ligand
BDBM50208804
Substrate
Meas. Tech.
ChEMBL_429487 (CHEMBL918609)
Ki
45±n/a nM
Citation
 Adachi, HPalaniappan, KKIvanov, AABergman, NGao, ZGJacobson, KA Structure-activity relationships of 2,N(6),5'-substituted adenosine derivatives with potent activity at the A2B adenosine receptor. J Med Chem 50:1810-27 (2007)  
Target
Name:
Adenosine receptor A2a
Synonyms:
A2A adenosine receptor (hA2A) ADENOSINE A2 ADORA2 Adenosine A2A receptor (A2AAR)
Type:
G Protein-Coupled Receptor (GPCR)
Mol. Mass.:
44716.46
Organism:
Homo sapiens (Human)
Description:
P29274
Residue:
412
  
Inhibitor
Name:
BDBM50208804
Synonyms:
(2R,3R,4S,5R)-2-(2-(2-(1H-indol-3-yl)ethoxy)-6-amino-9H-purin-9-yl)-5-(hydroxymethyl)-tetrahydrofuran-3,4-diol CHEMBL223366
Type:
Small organic molecule
Emp. Form.:
C20H22N6O5
Mol. Mass.:
426.4259
SMILES:
Nc1nc(OCCc2c[nH]c3ccccc23)nc2n(cnc12)[C@@H]1O[C@H](CO)[C@@H](O)[C@H]1O
: