Target
Adenosine receptor A1
Ligand
BDBM50156616
Substrate
Meas. Tech.
ChEMBL_429601 (CHEMBL919033)
Ki
3300±n/a nM
Citation
 Peng, HKumaravel, GYao, GSha, LWang, JVan Vlijmen, HBohnert, THuang, CVu, CBEnsinger, CLChang, HEngber, TMWhalley, ETPetter, RC Novel bicyclic piperazine derivatives of triazolotriazine and triazolopyrimidines as highly potent and selective adenosine A2A receptor antagonists. J Med Chem 47:6218-29 (2004)  
Target
Name:
Adenosine receptor A1
Synonyms:
AA1R_RAT ADENOSINE A1 high Adenosine A1 receptor (A1) Adenosine receptors A1 | Adora1
Type:
Protein
Mol. Mass.:
36704.13
Organism:
Rattus norvegicus (rat)
Description:
Residue:
326
  
Inhibitor
Name:
BDBM50156616
Synonyms:
(7RS,9aRS)-5-[7-(3-fluoro-phenoxymethyl)-octahydro-pyrido[1,2-a]pyrazin-2-yl]-2-furan-2-yl-[1,2,4]triazolo[1,5-a][1,3,5]triazin-7-ylamine CHEMBL373700
Type:
Small organic molecule
Emp. Form.:
C23H25FN8O2
Mol. Mass.:
464.4954
SMILES:
Nc1nc(nc2nc(nn12)-c1ccco1)N1CCN2C[C@@H](COc3cccc(F)c3)CC[C@H]2C1
: