Target
Cannabinoid receptor 1
Ligand
BDBM50177158
Substrate
Meas. Tech.
ChEMBL_431067 (CHEMBL917772)
Ki
1800±n/a nM
Citation
 Muccioli, GGWouters, JScriba, GKPoppitz, WPoupaert, JHLambert, DM 1-Benzhydryl-3-phenylurea and 1-benzhydryl-3-phenylthiourea derivatives: new templates among the CB1 cannabinoid receptor inverse agonists. J Med Chem 48:7486-90 (2005)  
Target
Name:
Cannabinoid receptor 1
Synonyms:
CANN6 CB-R CNR CNR1_HUMAN Cannabinoid receptor Cannabinoid receptor 1 (brain)
Type:
G Protein-Coupled Receptor (GPCR)
Mol. Mass.:
52868.96
Organism:
Homo sapiens (Human)
Description:
P21554
Residue:
472
  
Inhibitor
Name:
BDBM50177158
Synonyms:
1-[bis(4-bromophenyl)methyl]-3-phenylthiourea | CHEMBL224904
Type:
Small organic molecule
Emp. Form.:
C20H16Br2N2S
Mol. Mass.:
476.227
SMILES:
Brc1ccc(cc1)C(NC(=S)Nc1ccccc1)c1ccc(Br)cc1
: