Target
Adenosine receptor A1
Ligand
BDBM50205586
Substrate
Meas. Tech.
ChEMBL_435757 (CHEMBL904111)
Ki
4.7±n/a nM
Citation
 Baraldi, PGPreti, DTabrizi, MAFruttarolo, FSaponaro, GBaraldi, SRomagnoli, RMoorman, ARGessi, SVarani, KBorea, PA N(6)-[(hetero)aryl/(cyclo)alkyl-carbamoyl-methoxy-phenyl]-(2-chloro)-5'-N-ethylcarboxamido-adenosines: the first example of adenosine-related structures with potent agonist activity at the human A(2B) adenosine receptor. Bioorg Med Chem 15:2514-27 (2007)  
Target
Name:
Adenosine receptor A1
Synonyms:
A1 adenosine receptor (hA1) AA1R_HUMAN ADORA1 Adenosine A1-receptor Adenosine receptor A1 (hA1) | Adenosine transporter (AdT)
Type:
G Protein-Coupled Receptor (GPCR)
Mol. Mass.:
36520.92
Organism:
Homo sapiens (Human)
Description:
P30542
Residue:
326
  
Inhibitor
Name:
BDBM50205586
Synonyms:
(2S,3S,4R,5R)-N-ethyl-3,4-dihydroxy-5-(6-(4-(2-(4-methoxyphenylamino)-2-oxoethoxy)phenylamino)-9H-purin-9-yl)-tetrahydrofuran-2-carboxamide CHEMBL226243
Type:
Small organic molecule
Emp. Form.:
C27H29N7O7
Mol. Mass.:
563.5619
SMILES:
CCNC(=O)[C@H]1O[C@H]([C@H](O)[C@@H]1O)n1cnc2c(Nc3ccc(OCC(=O)Nc4ccc(OC)cc4)cc3)ncnc12
: