Target
Isocitrate lyase
Ligand
BDBM50206259
Substrate
Meas. Tech.
ChEMBL_438441 (CHEMBL886419)
IC50
15000±n/a nM
Citation
 Lee, HSLee, THYang, SHShin, HJShin, JOh, KB Sesterterpene sulfates as isocitrate lyase inhibitors from tropical sponge Hippospongia sp. Bioorg Med Chem Lett 17:2483-6 (2007)  
Target
Name:
Isocitrate lyase
Synonyms:
ACEA_MAGO7 ICL1 Isocitratase
Type:
PROTEIN
Mol. Mass.:
61002.51
Organism:
Magnaporthe oryzae (strain 70-15 / FGSC 8958) (Rice blast fungus)(Pyricularia oryzae)
Description:
ChEMBL_438441
Residue:
547
  
Inhibitor
Name:
BDBM50206259
Synonyms:
CHEMBL230058 | hydrohalisulfate 1
Type:
Small organic molecule
Emp. Form.:
C31H48O3
Mol. Mass.:
468.711
SMILES:
C[C@H](CCC\C(C)=C\Cc1cc(O)ccc1O)[C@H](O)C[C@H]1C(C)=CC[C@H]2C(C)(C)CCC[C@]12C
: