Target
Potassium voltage-gated channel subfamily H member 2
Ligand
BDBM50214364
Substrate
Meas. Tech.
ChEMBL_438965 (CHEMBL889315)
Ki
3.6±n/a nM
Citation
 Singleton, DHBoyd, HSteidl-Nichols, JVDeacon, MGroot, MJPrice, DNettleton, DOWallace, NKTroutman, MDWilliams, CBoyd, JG Fluorescently labeled analogues of dofetilide as high-affinity fluorescence polarization ligands for the human ether-a-go-go-related gene (hERG) channel. J Med Chem 50:2931-41 (2007)  
Target
Name:
Potassium voltage-gated channel subfamily H member 2
Synonyms:
1,3-beta-glucan synthase component GLS2 ERG Eag-related protein 1 Ether-a-go-go-related gene (HERG) Ether-a-go-go-related gene potassium channel 1 Ether-a-go-go-related gene potassium channel 1 (hERG1) Ether-a-go-go-related protein 1 H-ERG KCNH2 Potassium voltage-gated channel subfamily H member 2 (hERG) Voltage-gated potassium channel subunit Kv11.1 hERG Potassium Channel 1 | putative potassium channel subunit
Type:
Multi-pass membrane protein
Mol. Mass.:
126672.65
Organism:
Homo sapiens (Human)
Description:
Q12809
Residue:
1159
  
Inhibitor
Name:
BDBM50214364
Synonyms:
11-ethyl-1-(3-{[2-(4-methanesulfonylamino-phenoxy)-ethyl]-[2-(4-methanesulfonylamino-phenyl)-ethyl]-carbamoyl}-propyl)-3,4,5a,6,8,9,10,11-octahydro-2H-13-oxa-6,11-diaza-1-azonia-pentacene | CHEMBL390301
Type:
Small organic molecule
Emp. Form.:
C42H53N6O7S2
Mol. Mass.:
818.036
SMILES:
CCN1CCCc2cc3NC4C=C5CCC[N+](CCCC(=O)N(CCOc6ccc(NS(C)(=O)=O)cc6)CCc6ccc(NS(C)(=O)=O)cc6)=C5C=C4Oc3cc12
: