Target
Carbonic anhydrase 3
Ligand
BDBM10859
Substrate
Meas. Tech.
ChEMBL_449604 (CHEMBL898699)
Ki
7900±n/a nM
Citation
 Nishimori, IMinakuchi, TOnishi, SVullo, DCecchi, AScozzafava, ASupuran, CT Carbonic anhydrase inhibitors: cloning, characterization, and inhibition studies of the cytosolic isozyme III with sulfonamides. Bioorg Med Chem 15:7229-36 (2007)  
Target
Name:
Carbonic anhydrase 3
Synonyms:
CA-III CAH3_HUMAN Carbonic Anhydrase III Carbonic anhydrase 3 (CA III) | Carbonic anhydrase III (CA III)
Type:
Enzyme
Mol. Mass.:
29562.11
Organism:
Homo sapiens (Human)
Description:
Human cloned isozyme.
Residue:
260
  
Inhibitor
Name:
BDBM10859
Synonyms:
4-methylbenzene-1-sulfonamide aromatic/heteroaromatic sulfonamide 4 | hCA inhibitor, 7
Type:
Small organic molecule
Emp. Form.:
C7H9NO2S
Mol. Mass.:
171.217
SMILES:
Cc1ccc(cc1)S(N)(=O)=O
: