Target
P2Y purinoceptor 2
Ligand
BDBM50195825
Substrate
Meas. Tech.
ChEMBL_452954 (CHEMBL902099)
EC50
5±n/a nM
Citation
 Brookings, DDavenport, RJDavis, JGalvin, FCLloyd, SMack, SROwens, RSabin, VWynn, J Novel nucleotide triphosphates as potent P2Y2 agonists. Bioorg Med Chem Lett 17:562-5 (2007)  
Target
Name:
P2Y purinoceptor 2
Synonyms:
ATP receptor P2RY2 P2U purinoceptor 1 P2Y purinoceptor 2 Purinergic receptor | Purinergic receptor P2Y2
Type:
PROTEIN
Mol. Mass.:
42299.21
Organism:
Homo sapiens (Human)
Description:
ChEMBL_1455361
Residue:
377
  
Inhibitor
Name:
BDBM50195825
Synonyms:
({[({[(2R,3S,4R,5R)-5-(7-fluoro-1-oxo-1,2-dihydroisoquinolin-2-yl)-3,4-dihydroxyoxolan-2-yl]methoxy}(hydroxy)phosphoryl)oxy](hydroxy)phosphoryl}oxy)phosphonic acid | CHEMBL399017
Type:
Small organic molecule
Emp. Form.:
C14H17FNO14P3
Mol. Mass.:
535.2028
SMILES:
O[C@H]1[C@@H](O)[C@@H](O[C@@H]1COP(O)(=O)OP(O)(=O)OP(O)(O)=O)n1ccc2ccc(F)cc2c1=O
: