Target
Sphingosine 1-phosphate receptor 4
Ligand
BDBM23164
Substrate
Meas. Tech.
ChEMBL_453248 (CHEMBL902402)
EC50
18.6±n/a nM
Citation
 Hanessian, SCharron, GBillich, AGuerini, D Constrained azacyclic analogues of the immunomodulatory agent FTY720 as molecular probes for sphingosine 1-phosphate receptors. Bioorg Med Chem Lett 17:491-4 (2007)  
Target
Name:
Sphingosine 1-phosphate receptor 4
Synonyms:
EDG6 S1P receptor 4 S1P4 S1PR4_HUMAN Sphingosine 1-phosphate receptor Edg-6 sphingosine-1-phosphate 4 S1P4
Type:
G Protein-Coupled Receptor (GPCR)
Mol. Mass.:
41647.39
Organism:
Homo sapiens (Human)
Description:
Residue:
384
  
Inhibitor
Name:
BDBM23164
Synonyms:
CHEMBL190006 [(2R)-2-amino-3-hydroxy-2-[2-(4-octylphenyl)ethyl]propoxy]phosphonic acid
Type:
Small organic molecule
Emp. Form.:
C19H34NO5P
Mol. Mass.:
387.4507
SMILES:
CCCCCCCCc1ccc(CC[C@@](N)(CO)COP(O)(O)=O)cc1
: