Target
P2Y purinoceptor 1
Ligand
BDBM50118213
Substrate
Meas. Tech.
ChEMBL_453275 (CHEMBL902430)
EC50
>2000±n/a nM
Citation
 Davenport, RJDiaz, PGalvin, FCLloyd, SMack, SROwens, RSabin, VWynn, J Novel nucleotide triphosphates as potent P2Y2 agonists with enhanced stability over UTP. Bioorg Med Chem Lett 17:558-61 (2007)  
Target
Name:
P2Y purinoceptor 1
Synonyms:
ATP receptor P2RY1_HUMAN P2Y1 Purinergic receptor P2Y1
Type:
Enzyme
Mol. Mass.:
42090.25
Organism:
Homo sapiens (Human)
Description:
P47900
Residue:
373
  
Inhibitor
Name:
BDBM50118213
Synonyms:
5'-UTP H4utp uridine 5'-(tetrahydrogen triphosphate) | uridine 5'-triphosphoric acid
Type:
Small organic molecule
Emp. Form.:
C9H15N2O15P3
Mol. Mass.:
484.1411
SMILES:
O[C@@H]1[C@@H](COP(O)(=O)OP(O)(=O)OP(O)(O)=O)O[C@H]([C@@H]1O)n1ccc(=O)[nH]c1=O
: