Target
5-hydroxytryptamine receptor 2A
Ligand
BDBM50205793
Substrate
Meas. Tech.
ChEMBL_454643 (CHEMBL886663)
Ki
2.6±n/a nM
Citation
 Wilson, KJvan Niel, MBCooper, LBloomfield, DO'Connor, DFish, LRMacLeod, AM 2,5-Disubstituted pyridines: the discovery of a novel series of 5-HT2A ligands. Bioorg Med Chem Lett 17:2643-8 (2007)  
Target
Name:
5-hydroxytryptamine receptor 2A
Synonyms:
5-HT-2 5-HT2A 5-hydroxytryptamine receptor 2A (5HT-2A) 5HT2A_HUMAN HTR2A | Serotonin receptor 2A
Type:
undefined
Mol. Mass.:
52607.65
Organism:
Homo sapiens (Human)
Description:
P28223
Residue:
471
  
Inhibitor
Name:
BDBM50205793
Synonyms:
(E)-2-(2,4-difluorostyryl)-5-(2-fluorophenylsulfonyl)pyridine | CHEMBL240865
Type:
Small organic molecule
Emp. Form.:
C19H12F3NO2S
Mol. Mass.:
375.364
SMILES:
Fc1ccc(\C=C\c2ccc(cn2)S(=O)(=O)c2ccccc2F)c(F)c1
: