Target
Estrogen receptor
Ligand
BDBM50223232
Substrate
Meas. Tech.
ChEMBL_458134 (CHEMBL925467)
IC50
5300±n/a nM
Citation
 Blizzard, TAGude, CMorgan, JDChan, WBirzin, ETMojena, MTudela, CChen, FKnecht, KSu, QKraker, BMosley, RTHolmes, MARohrer, SPHammond, ML Androstene-3,5-dienes as ER-beta selective SERMs. Bioorg Med Chem Lett 17:6295-8 (2007)  
Target
Name:
Estrogen receptor
Synonyms:
ER ESR ESR1_HUMAN Estrogen receptor Estrogen receptor (ER-alpha) Estrogen receptor alpha (ER) Nuclear receptor subfamily 3 group A member 1
Type:
Protein
Mol. Mass.:
66230.44
Organism:
Homo sapiens (Human)
Description:
P03372
Residue:
595
  
Inhibitor
Name:
BDBM50223232
Synonyms:
(3S,8R,9S,10S,13S,14S,17S)-3,13-dimethyl-10-vinyl-2,3,4,7,8,9,10,11,12,13,14,15,16,17-tetradecahydro-1H-cyclopenta[a]phenanthrene-3,17-diol | CHEMBL398455
Type:
Small organic molecule
Emp. Form.:
C21H32O2
Mol. Mass.:
316.4776
SMILES:
C[C@]12CC[C@H]3[C@@H](CC=C4C[C@@](C)(O)CC[C@]34C=C)[C@@H]1CC[C@@H]2O
: