Target
Lanosterol synthase
Ligand
BDBM50055641
Substrate
Meas. Tech.
ChEMBL_459088 (CHEMBL925174)
IC50
50±n/a nM
Citation
 Jain, KSKathiravan, MKSomani, RSShishoo, CJ The biology and chemistry of hyperlipidemia. Bioorg Med Chem 15:4674-99 (2007)  
Target
Name:
Lanosterol synthase
Synonyms:
LSS_RAT Osc
Type:
PROTEIN
Mol. Mass.:
83302.12
Organism:
Rattus norvegicus
Description:
ChEMBL_12083
Residue:
733
  
Inhibitor
Name:
BDBM50055641
Synonyms:
2,2-dimethyl-3-((3E,7E,11E)-3,7,12-trimethyl-14-(6-methylhept-5-en-2-ylthio)tetradeca-3,7,11-trienyl)oxirane CHEMBL64905
Type:
Small organic molecule
Emp. Form.:
C29H50OS
Mol. Mass.:
446.772
SMILES:
[#6]-[#6](-[#6]-[#6]\[#6]=[#6](\[#6])-[#6])-[#16]-[#6]-[#6]\[#6](-[#6])=[#6]\[#6]-[#6]\[#6]=[#6](/[#6])-[#6]-[#6]\[#6]=[#6](/[#6])-[#6]-[#6]-[#6]1-[#8]C1([#6])[#6]
: