Target
Lanosterol synthase
Ligand
BDBM50213691
Substrate
Meas. Tech.
ChEMBL_459088 (CHEMBL925174)
IC50
700±n/a nM
Citation
 Jain, KSKathiravan, MKSomani, RSShishoo, CJ The biology and chemistry of hyperlipidemia. Bioorg Med Chem 15:4674-99 (2007)  
Target
Name:
Lanosterol synthase
Synonyms:
LSS_RAT Osc
Type:
PROTEIN
Mol. Mass.:
83302.12
Organism:
Rattus norvegicus
Description:
ChEMBL_12083
Residue:
733
  
Inhibitor
Name:
BDBM50213691
Synonyms:
1-((5S,6S,8aS)-6-hydroxy-5,8a-dimethyl-octahydroisoquinolin-2(1H)-yl)tridecan-1-one | CHEMBL253787
Type:
Small organic molecule
Emp. Form.:
C24H45NO2
Mol. Mass.:
379.6196
SMILES:
CCCCCCCCCCCCC(=O)N1CCC2[C@H](C)[C@@H](O)CC[C@]2(C)C1
: