Target
Tissue-type plasminogen activator
Ligand
BDBM12676
Substrate
Meas. Tech.
ChEMBL_461717 (CHEMBL928848)
Ki
>33000±n/a nM
Citation
 Varnes, JGWacker, DAPinto, DJOrwat, MJTheroff, JPWells, BGalemo, RALuettgen, JMKnabb, RMBai, SHe, KLam, PYWexler, RR Structure-activity relationship and pharmacokinetic profile of 5-ketopyrazole factor Xa inhibitors. Bioorg Med Chem Lett 18:749-54 (2008)  
Target
Name:
Tissue-type plasminogen activator
Synonyms:
Alteplase Reteplase Thrombin receptor protein Tissue-type plasminogen activator (tPA) t-PA t-plasminogen activator
Type:
Enzyme
Mol. Mass.:
62931.08
Organism:
Homo sapiens (Human)
Description:
Residue:
562
  
Inhibitor
Name:
BDBM12676
Synonyms:
1-(3-Aminobenzisoxazol-5-yl)-3-trifluoromethyl-N-[2-fluoro-4-[(2-dimethylaminomethyl)imidazol-1-yl]phenyl]-1H-pyrazole-5-carboxyamide Hydrochloride Salt BMS-561389 CHEMBL558198 Razaxaban
Type:
Small organic molecule
Emp. Form.:
C24H20F4N8O2
Mol. Mass.:
528.4616
SMILES:
CN(C)Cc1nccn1-c1ccc(NC(=O)c2cc(nn2-c2ccc3onc(N)c3c2)C(F)(F)F)c(F)c1
: