Target
B1 bradykinin receptor
Ligand
BDBM50229295
Substrate
Meas. Tech.
ChEMBL_463209 (CHEMBL947206)
Ki
0.66±n/a nM
Citation
 Wood, MRSchirripa, KMKim, JJKuduk, SDChang, RKDi Marco, CNDiPardo, RMWan, BLMurphy, KLRansom, RWChang, RSHolahan, MACook, JJLemaire, WMosser, SDBednar, RATang, CPrueksaritanont, TWallace, AAMei, QYu, JBohn, DLClayton, FCAdarayn, EDSitko, GRLeonard, YMFreidinger, RMPettibone, DJBock, MG Alpha-hydroxy amides as a novel class of bradykinin B1 selective antagonists. Bioorg Med Chem Lett 18:716-20 (2008)  
Target
Name:
B1 bradykinin receptor
Synonyms:
B1 BRADYKININ B1R BK-1 receptor BRADYB1 | Bradykinin B1 receptor
Type:
Enzyme
Mol. Mass.:
40508.87
Organism:
Homo sapiens (Human)
Description:
P46663
Residue:
353
  
Inhibitor
Name:
BDBM50229295
Synonyms:
(R)-N-((R)-1-(5-(5-chloro-3-fluoro-2-(5-methyl-1,2,4-oxadiazol-3-yl)phenyl)-3-fluoropyridin-2-yl)ethyl)-3,3,3-trifluoro-2-hydroxy-2-methylpropanamide | CHEMBL402831
Type:
Small organic molecule
Emp. Form.:
C20H16ClF5N4O3
Mol. Mass.:
490.811
SMILES:
C[C@@H](NC(=O)[C@@](C)(O)C(F)(F)F)c1ncc(cc1F)-c1cc(Cl)cc(F)c1-c1noc(C)n1
: