Target
Epidermal growth factor receptor
Ligand
BDBM50371364
Substrate
Meas. Tech.
ChEMBL_463277 (CHEMBL930778)
IC50
22±n/a nM
Citation
 Barlaam, BBallard, PBradbury, RHDucray, RGermain, HHickinson, DMHudson, KKettle, JGKlinowska, TMagnien, FOgilvie, DJOlivier, APearson, SEScott, JSSuleman, ATrigwell, CBVautier, MWhittaker, RDWood, R A new series of neutral 5-substituted 4-anilinoquinazolines as potent, orally active inhibitors of erbB2 receptor tyrosine kinase. Bioorg Med Chem Lett 18:674-8 (2008)  
Target
Name:
Epidermal growth factor receptor
Synonyms:
EGF Receptor Substrate EGFR_HUMAN ERBB1 Epidermal Growth Factor Receptor erbB-1 Epidermal growth factor receptor (EGFR) HER1 Proto-oncogene c-ErbB-1 Tyrosine-Protein Kinase ErbB-1
Type:
Receptor Kinase Domain
Mol. Mass.:
134279.59
Organism:
Homo sapiens (Human)
Description:
P00533
Residue:
1210
  
Inhibitor
Name:
BDBM50371364
Synonyms:
CHEMBL428777
Type:
Small organic molecule
Emp. Form.:
C25H24ClN5O3
Mol. Mass.:
477.943
SMILES:
C[C@@H](Oc1cccc2ncnc(Nc3ccc(OCc4ccccn4)c(Cl)c3)c12)C(=O)N(C)C
: