Target
Dual specificity tyrosine-phosphorylation-regulated kinase 1A
Ligand
BDBM50371403
Substrate
Meas. Tech.
ChEMBL_463331 (CHEMBL947132)
IC50
35±n/a nM
Citation
 Echalier, ABettayeb, KFerandin, YLozach, OClément, MValette, ALiger, FMarquet, BMorris, JCEndicott, JAJoseph, BMeijer, L Meriolins (3-(pyrimidin-4-yl)-7-azaindoles): synthesis, kinase inhibitory activity, cellular effects, and structure of a CDK2/cyclin A/meriolin complex. J Med Chem 51:737-51 (2008)  
Target
Name:
Dual specificity tyrosine-phosphorylation-regulated kinase 1A
Synonyms:
DYR1A_RAT Dual-specificity tyrosine-(Y)-phosphorylation regulated kinase 1A Dyrk1a
Type:
Enzyme Catalytic Domain
Mol. Mass.:
85573.59
Organism:
RAT
Description:
Dual-specificity tyrosine-(Y)-phosphorylation regulated kinase 1A 0 RAT::Q63470
Residue:
763
  
Inhibitor
Name:
BDBM50371403
Synonyms:
MERIOLIN 2
Type:
Small organic molecule
Emp. Form.:
C11H9N5O
Mol. Mass.:
227.2221
SMILES:
Nc1nccc(n1)-c1c[nH]c2nccc(O)c12
: