Target
C-X-C chemokine receptor type 3
Ligand
BDBM50371495
Substrate
Meas. Tech.
ChEMBL_463732 (CHEMBL932090)
IC50
11±n/a nM
Citation
 Du, XChen, XMihalic, JTDeignan, JDuquette, JLi, ARLemon, BMa, JMiao, SEbsworth, KSullivan, TJTonn, GCollins, TLMedina, JC Design and optimization of imidazole derivatives as potent CXCR3 antagonists. Bioorg Med Chem Lett 18:608-13 (2008)  
Target
Name:
C-X-C chemokine receptor type 3
Synonyms:
AAO92295.1 C-X-C chemokine receptor type 3 (CXCR3) CXCR3 CXCR3_HUMAN chemokine (C-X-C motif) receptor 3
Type:
Enzyme Catalytic Domain
Mol. Mass.:
40665.65
Organism:
Homo sapiens (Human)
Description:
Residue:
368
  
Inhibitor
Name:
BDBM50371495
Synonyms:
CHEMBL403379
Type:
Small organic molecule
Emp. Form.:
C32H33F4N3O3
Mol. Mass.:
583.6163
SMILES:
CCOCCN([C@H](C)c1nc(cn1-c1ccc(OCC)cc1)-c1ccccc1)C(=O)Cc1ccc(F)c(c1)C(F)(F)F
: