Target
B1 bradykinin receptor
Ligand
BDBM50371648
Substrate
Meas. Tech.
ChEMBL_463823 (CHEMBL948902)
Ki
2.3±n/a nM
Citation
 Feng, DMDiPardo, RMWai, JMChang, RKDi Marco, CNMurphy, KLRansom, RWReiss, DRTang, CPrueksaritanont, TPettibone, DJBock, MGKuduk, SD A new class of bradykinin B1 receptor antagonists with high oral bioavailability and minimal PXR activity. Bioorg Med Chem Lett 18:682-7 (2008)  
Target
Name:
B1 bradykinin receptor
Synonyms:
B1 BRADYKININ B1R BK-1 receptor BRADYB1 | Bradykinin B1 receptor
Type:
Enzyme
Mol. Mass.:
40508.87
Organism:
Homo sapiens (Human)
Description:
P46663
Residue:
353
  
Inhibitor
Name:
BDBM50371648
Synonyms:
CHEMBL255325
Type:
Small organic molecule
Emp. Form.:
C23H22Cl2F4N2O3
Mol. Mass.:
521.332
SMILES:
CC(C)Oc1c(Cl)cc(Cl)cc1-c1ccc([C@@H](C)NC(=O)C2(CC2)NC(=O)C(F)(F)F)c(F)c1
: