Target
P2Y purinoceptor 2
Ligand
BDBM50371702
Substrate
Meas. Tech.
ChEMBL_463989 (CHEMBL929976)
IC50
9260±n/a nM
Citation
 Weyler, SBaqi, YHillmann, PKaulich, MHunder, AMMüller, IAMüller, CE Combinatorial synthesis of anilinoanthraquinone derivatives and evaluation as non-nucleotide-derived P2Y2 receptor antagonists. Bioorg Med Chem Lett 18:223-7 (2008)  
Target
Name:
P2Y purinoceptor 2
Synonyms:
ATP receptor P2RY2 P2U purinoceptor 1 P2Y purinoceptor 2 Purinergic receptor | Purinergic receptor P2Y2
Type:
PROTEIN
Mol. Mass.:
42299.21
Organism:
Homo sapiens (Human)
Description:
ChEMBL_1455361
Residue:
377
  
Inhibitor
Name:
BDBM50371702
Synonyms:
CHEMBL402238
Type:
Small organic molecule
Emp. Form.:
C22H17N2O5S
Mol. Mass.:
421.446
SMILES:
CCc1ccccc1Nc1cc(c(N)c2C(=O)c3ccccc3C(=O)c12)S([O-])(=O)=O
: