Target
Macrophage colony-stimulating factor 1 receptor
Ligand
BDBM50371928
Substrate
Meas. Tech.
ChEMBL_464342 (CHEMBL951197)
IC50
180±n/a nM
Citation
 Wall, MJChen, JMeegalla, SBallentine, SKWilson, KJDesJarlais, RLSchubert, CChaikin, MACrysler, CPetrounia, IPDonatelli, RRYurkow, EJBoczon, LMazzulla, MPlayer, MRPatch, RJManthey, CLMolloy, CTomczuk, BIllig, CR Synthesis and evaluation of novel 3,4,6-substituted 2-quinolones as FMS kinase inhibitors. Bioorg Med Chem Lett 18:2097-102 (2008)  
Target
Name:
Macrophage colony-stimulating factor 1 receptor
Synonyms:
CSF1R FMS Macrophage colony stimulating factor receptor Macrophage colony-stimulating factor 1 receptor (c-FMS) Proto-oncogene c-Fms c-fms | cFMS
Type:
Protein
Mol. Mass.:
107979.48
Organism:
Homo sapiens (Human)
Description:
P07333
Residue:
972
  
Inhibitor
Name:
BDBM50371928
Synonyms:
CHEMBL258088
Type:
Small organic molecule
Emp. Form.:
C18H12ClN3O
Mol. Mass.:
321.76
SMILES:
Clc1ccc2[nH]c(=O)c(-c3c[nH]cn3)c(-c3ccccc3)c2c1
: