Target
Cocaine esterase
Ligand
BDBM50371964
Substrate
Meas. Tech.
ChEMBL_464383 (CHEMBL930032)
IC50
26±n/a nM
Citation
 Wheelock, CENishi, KYing, AJones, PDColvin, MEOlmstead, MMHammock, BD Influence of sulfur oxidation state and steric bulk upon trifluoromethyl ketone (TFK) binding kinetics to carboxylesterases and fatty acid amide hydrolase (FAAH). Bioorg Med Chem 16:2114-30 (2008)  
Target
Name:
Cocaine esterase
Synonyms:
CES2 EST2_HUMAN | ICE
Type:
PROTEIN
Mol. Mass.:
61801.08
Organism:
Homo sapiens (Human)
Description:
ChEMBL_1494240
Residue:
559
  
Inhibitor
Name:
BDBM50371964
Synonyms:
CHEMBL273139
Type:
Small organic molecule
Emp. Form.:
C11H19F3O3S
Mol. Mass.:
288.327
SMILES:
CCCCCCCCS(=O)(=O)CC(=O)C(F)(F)F
: