Target
Prothrombin
Ligand
BDBM50067796
Substrate
Meas. Tech.
ChEMBL_464664 (CHEMBL933925)
Ki
0.5±n/a nM
Citation
 Isaacs, RCSolinsky, MGCutrona, KJNewton, CLNaylor-Olsen, AMMcMasters, DRKrueger, JALewis, SDLucas, BJKuo, LCYan, YLynch, JJLyle, EA Structure-based design of novel groups for use in the P1 position of thrombin inhibitor scaffolds. Part 2: N-acetamidoimidazoles. Bioorg Med Chem Lett 18:2062-6 (2008)  
Target
Name:
Prothrombin
Synonyms:
Activation peptide fragment 1 Coagulation factor II Prothrombin precursor Thrombin heavy chain | Thrombin light chain
Type:
Protein
Mol. Mass.:
70029.57
Organism:
Homo sapiens (Human)
Description:
P00734
Residue:
622
  
Inhibitor
Name:
BDBM50067796
Synonyms:
CHEMBL11157 N-((6-amino-2-methylpyridin-3-yl)methyl)-2-(6-methyl-2-oxo-3-(phenylmethylsulfonamido)pyridin-1(2H)-yl)acetamide | N-(6-Amino-2-methyl-pyridin-3-ylmethyl)-2-(6-methyl-2-oxo-3-phenylmethanesulfonylamino-2H-pyridin-1-yl)-acetamide
Type:
Small organic molecule
Emp. Form.:
C22H25N5O4S
Mol. Mass.:
455.53
SMILES:
Cc1nc(N)ccc1CNC(=O)Cn1c(C)ccc(NS(=O)(=O)Cc2ccccc2)c1=O
: