Target
Tyrosine-protein kinase Lck
Ligand
BDBM50372706
Substrate
Meas. Tech.
ChEMBL_465744 (CHEMBL948988)
IC50
0.6±n/a nM
Citation
 Deak, HLNewcomb, JRNunes, JJBoucher, CCheng, ACDiMauro, EFEpstein, LFGallant, PHodous, BLHuang, XLee, JHPatel, VFSchneider, STurci, SMZhu, X N-(3-(phenylcarbamoyl)arylpyrimidine)-5-carboxamides as potent and selective inhibitors of Lck: structure, synthesis and SAR. Bioorg Med Chem Lett 18:1172-6 (2008)  
Target
Name:
Tyrosine-protein kinase Lck
Synonyms:
2.7.10.2 LCK_HUMAN Leukocyte C-terminal Src kinase Lymphocyte-specific protein tyrosine kinase Protein YT16 Proto-oncogene tyrosine-protein kinase LCK T cell-specific protein-tyrosine kinase
Type:
Mol. Mass.:
57987.83
Organism:
Homo sapiens (Human)
Description:
P06239
Residue:
509
  
Inhibitor
Name:
BDBM50372706
Synonyms:
CHEMBL257858
Type:
Small organic molecule
Emp. Form.:
C32H31F4N7O3
Mol. Mass.:
637.6273
SMILES:
COc1nc(Nc2ccc(cc2)N2CCN(C)CC2)ncc1C(=O)Nc1cc(ccc1C)C(=O)Nc1cccc(c1F)C(F)(F)F
: