Target
Angiopoietin-1 receptor
Ligand
BDBM50372710
Substrate
Meas. Tech.
ChEMBL_465748 (CHEMBL948992)
IC50
>25000±n/a nM
Citation
 Deak, HLNewcomb, JRNunes, JJBoucher, CCheng, ACDiMauro, EFEpstein, LFGallant, PHodous, BLHuang, XLee, JHPatel, VFSchneider, STurci, SMZhu, X N-(3-(phenylcarbamoyl)arylpyrimidine)-5-carboxamides as potent and selective inhibitors of Lck: structure, synthesis and SAR. Bioorg Med Chem Lett 18:1172-6 (2008)  
Target
Name:
Angiopoietin-1 receptor
Synonyms:
TEK TIE2_HUMAN Tyrosine-protein kinase receptor (TIE-2) Tyrosine-protein kinase receptor TEK (p140 TEK) Tyrosine-protein kinase receptor TIE2/TEK VMCM1 p140 TEK
Type:
Enzyme
Mol. Mass.:
125835.70
Organism:
Homo sapiens (Human)
Description:
Q02763
Residue:
1124
  
Inhibitor
Name:
BDBM50372710
Synonyms:
CHEMBL255533
Type:
Small organic molecule
Emp. Form.:
C22H19F4N5O3
Mol. Mass.:
477.4116
SMILES:
CNc1ncc(C(=O)Nc2cc(ccc2C)C(=O)Nc2cccc(c2F)C(F)(F)F)c(OC)n1
: