Target
Quorum-sensing transcriptional repressor QscR
Ligand
BDBM50373107
Substrate
Meas. Tech.
ChEMBL_466843 (CHEMBL925891)
IC50
130±n/a nM
Citation
 Mattmann, MEGeske, GDWorzalla, GAChandler, JRSappington, KJGreenberg, EPBlackwell, HE Synthetic ligands that activate and inhibit a quorum-sensing regulator in Pseudomonas aeruginosa. Bioorg Med Chem Lett 18:3072-5 (2008)  
Target
Name:
Quorum-sensing transcriptional repressor QscR
Synonyms:
PhzR
Type:
PROTEIN
Mol. Mass.:
27251.33
Organism:
Pseudomonas aeruginosa
Description:
ChEMBL_466843
Residue:
237
  
Inhibitor
Name:
BDBM50373107
Synonyms:
CHEMBL259439
Type:
Small organic molecule
Emp. Form.:
C19H27NO3
Mol. Mass.:
317.4226
SMILES:
CCCCCCCCc1ccc(cc1)C(=O)N[C@H]1CCOC1=O
: