Target
Androgen receptor
Ligand
BDBM50373238
Substrate
Meas. Tech.
ChEMBL_467617 (CHEMBL930492)
Ki
1300±n/a nM
Citation
 Zhao, SShen, Yvan Oeveren, AMarschke, KBZhi, L Discovery of a novel series of nonsteroidal androgen receptor modulators: 5- or 6-oxachrysen-2-ones. Bioorg Med Chem Lett 18:3431-5 (2008)  
Target
Name:
Androgen receptor
Synonyms:
ANDR_HUMAN Androgen Receptor Androgen receptor/Baculoviral IAP repeat-containing protein 2 Dihydrotestosterone receptor Nuclear receptor subfamily 3 group C member 4
Type:
Receptor
Mol. Mass.:
99185.27
Organism:
Homo sapiens (Human)
Description:
CHO cells were stably transfected with human AR gene.
Residue:
920
  
Inhibitor
Name:
BDBM50373238
Synonyms:
CHEMBL258190
Type:
Small organic molecule
Emp. Form.:
C18H15NO4
Mol. Mass.:
309.316
SMILES:
COc1cccc2OC(O)c3c(ccc4[nH]c(=O)cc(C)c34)-c12
: