Target
Androgen receptor
Ligand
BDBM50373236
Substrate
Meas. Tech.
ChEMBL_467618 (CHEMBL930493)
IC50
1.9±n/a nM
Citation
 Zhao, SShen, Yvan Oeveren, AMarschke, KBZhi, L Discovery of a novel series of nonsteroidal androgen receptor modulators: 5- or 6-oxachrysen-2-ones. Bioorg Med Chem Lett 18:3431-5 (2008)  
Target
Name:
Androgen receptor
Synonyms:
ANDR_HUMAN Androgen Receptor Androgen receptor/Baculoviral IAP repeat-containing protein 2 Dihydrotestosterone receptor Nuclear receptor subfamily 3 group C member 4
Type:
Receptor
Mol. Mass.:
99185.27
Organism:
Homo sapiens (Human)
Description:
CHO cells were stably transfected with human AR gene.
Residue:
920
  
Inhibitor
Name:
BDBM50373236
Synonyms:
CHEMBL401711
Type:
Small organic molecule
Emp. Form.:
C22H19NO5
Mol. Mass.:
377.39
SMILES:
Cc1cc(=O)[nH]c2ccc3c4c(cccc4oc(=O)c3c12)C(=O)OC(C)(C)C
: