Target
5-hydroxytryptamine receptor 1A
Ligand
BDBM50373903
Substrate
Meas. Tech.
ChEMBL_468662 (CHEMBL950989)
Ki
33±n/a nM
Citation
 Lacivita, ELeopoldo, M N-[omega-[4-(2-methoxyphenyl)-1-piperazinyl]alkyl]-2-quinolinamines as high-affinity fluorescent 5-HT1A receptor ligands. J Med Chem 51:1492-5 (2008)  
Target
Name:
5-hydroxytryptamine receptor 1A
Synonyms:
5-HT-1A 5-hydroxytryptamine receptor 1A (5-HT-1A) ADRB2RL1 Dopamine D2 receptor and serotonin 1a receptor HTR1A | Serotonin receptor 1A
Type:
Mol. Mass.:
46122.49
Organism:
Homo sapiens (Human)
Description:
Residue:
422
  
Inhibitor
Name:
BDBM50373903
Synonyms:
CHEMBL259887
Type:
Small organic molecule
Emp. Form.:
C22H26N4O
Mol. Mass.:
362.468
SMILES:
COc1ccccc1N1CCN(CCNc2ccc3ccccc3n2)CC1
: