Target
Gag-Pol polyprotein [489-587]
Ligand
BDBM50373904
Substrate
Meas. Tech.
ChEMBL_468711 (CHEMBL929847)
IC50
290±n/a nM
Citation
 Righi, GCiambrone, SBonini, CCampaner, P Stereocontrolled synthesis and biological activity of two diastereoisomers of the potent HIV-1 protease inhibitor saquinavir. Bioorg Med Chem 16:902-8 (2008)  
Target
Name:
Gag-Pol polyprotein [489-587]
Synonyms:
Human immunodeficiency virus type 1 protease Pol polyprotein | gag-pol
Type:
Enzyme Subunit
Mol. Mass.:
10781.16
Organism:
Human immunodeficiency virus type 1
Description:
P04585[489-587]
Residue:
99
  
Inhibitor
Name:
BDBM50373904
Synonyms:
CHEMBL405969
Type:
Small organic molecule
Emp. Form.:
C38H50N6O5
Mol. Mass.:
670.8408
SMILES:
CC(C)(C)NC(=O)[C@@H]1C[C@@H]2CCCC[C@@H]2CN1C[C@H](O)[C@H](Cc1ccccc1)NC(=O)[C@H](CC(N)=O)NC(=O)c1ccc2ccccc2n1
: