Target
Epidermal growth factor receptor
Ligand
BDBM3556
Substrate
Meas. Tech.
ChEMBL_468986 (CHEMBL952131)
IC50
0.006026±n/a nM
Citation
 Kolb, PHuang, DDey, FCaflisch, A Discovery of kinase inhibitors by high-throughput docking and scoring based on a transferable linear interaction energy model. J Med Chem 51:1179-88 (2008)  
Target
Name:
Epidermal growth factor receptor
Synonyms:
EGF Receptor Substrate EGFR_HUMAN ERBB1 Epidermal Growth Factor Receptor erbB-1 Epidermal growth factor receptor (EGFR) HER1 Proto-oncogene c-ErbB-1 Tyrosine-Protein Kinase ErbB-1
Type:
Receptor Kinase Domain
Mol. Mass.:
134279.59
Organism:
Homo sapiens (Human)
Description:
P00533
Residue:
1210
  
Inhibitor
Name:
BDBM3556
Synonyms:
4-[(3-Bromophenyl)amino]-6,7-diethoxyquinazoline CHEMBL35820 PD153035 Analog | PD153035 Analog 56
Type:
Small organic molecule
Emp. Form.:
C18H18BrN3O2
Mol. Mass.:
388.258
SMILES:
CCOc1cc2ncnc(Nc3cccc(Br)c3)c2cc1OCC
: