Target
Nitric oxide synthase, inducible
Ligand
BDBM21959
Substrate
Meas. Tech.
ChEMBL_469819 (CHEMBL933386)
Kd
7000±n/a nM
Citation
 Martin, NIBeeson, WTWoodward, JJMarletta, MA N(G)-aminoguanidines from primary amines and the preparation of nitric oxide synthase inhibitors. J Med Chem 51:924-31 (2008)  
Target
Name:
Nitric oxide synthase, inducible
Synonyms:
HEP-NOS Inducible NO synthase NOS type II NOS2A Nitric oxide synthase, inducible (iNOS) | iNOS
Type:
Homodimer
Mol. Mass.:
131141.95
Organism:
Homo sapiens (Human)
Description:
P35228
Residue:
1153
  
Inhibitor
Name:
BDBM21959
Synonyms:
(2S)-2-amino-5-carbamimidamidopentanoic acid CHEMBL1485 | L-arginine
Type:
Amino Acid
Emp. Form.:
C6H14N4O2
Mol. Mass.:
174.201
SMILES:
[#7]-[#6@@H](-[#6]-[#6]-[#6]\[#7]=[#6](/[#7])-[#7])-[#6](-[#8])=O
: