Target
Mitogen-activated protein kinase kinase kinase 14
Ligand
BDBM50374681
Substrate
Meas. Tech.
ChEMBL_469844 (CHEMBL949032)
IC50
480±n/a nM
Citation
 Goldberg, DRChoi, YCogan, DCorson, MDeLeon, RGao, AGruenbaum, LHao, MHJoseph, DKashem, MAMiller, CMoss, NNetherton, MRPargellis, CPPelletier, JSellati, RSkow, DTorcellini, CTseng, YCWang, JWasti, RWerneburg, BWu, JPXiong, Z Pyrazinoindolone inhibitors of MAPKAP-K2. Bioorg Med Chem Lett 18:938-41 (2008)  
Target
Name:
Mitogen-activated protein kinase kinase kinase 14
Synonyms:
HsNIK MAP3K14 NF-kappa-beta-inducing kinase (NF-kB) Serine/threonine-protein kinase NIK
Type:
Protein
Mol. Mass.:
104059.50
Organism:
Homo sapiens (Human)
Description:
Q99558
Residue:
947
  
Inhibitor
Name:
BDBM50374681
Synonyms:
CHEMBL257834
Type:
Small organic molecule
Emp. Form.:
C29H36N6O3S
Mol. Mass.:
548.7
SMILES:
CC(C)(C)CN1CCC(CC1)NC(=O)c1csc(NC(=O)c2ccc3cc4C(=O)NCC5(CCC5)n4c3c2)n1
: