Target
MAP kinase-activated protein kinase 2
Ligand
BDBM50374695
Substrate
Meas. Tech.
ChEMBL_469831 (CHEMBL949020)
IC50
10±n/a nM
Citation
 Goldberg, DRChoi, YCogan, DCorson, MDeLeon, RGao, AGruenbaum, LHao, MHJoseph, DKashem, MAMiller, CMoss, NNetherton, MRPargellis, CPPelletier, JSellati, RSkow, DTorcellini, CTseng, YCWang, JWasti, RWerneburg, BWu, JPXiong, Z Pyrazinoindolone inhibitors of MAPKAP-K2. Bioorg Med Chem Lett 18:938-41 (2008)  
Target
Name:
MAP kinase-activated protein kinase 2
Synonyms:
MAP kinase-activated protein kinase 2 (MAPKAPK2) MAP kinase-activated protein kinase 2 (p38/MK2) MAPK-activated protein kinase 2 MAPKAP kinase 2 MAPKAPK2 | MK2
Type:
Serine/threonine-protein kinase
Mol. Mass.:
45579.87
Organism:
Homo sapiens (Human)
Description:
P49137
Residue:
400
  
Inhibitor
Name:
BDBM50374695
Synonyms:
CHEMBL246301
Type:
Small organic molecule
Emp. Form.:
C23H26N6O3S
Mol. Mass.:
466.556
SMILES:
CC1CNC(=O)c2[nH]c3ccc(cc3c12)C(=O)Nc1nc(cs1)C(=O)NC1CCN(C)CC1
: