Target
Macrophage colony-stimulating factor 1 receptor
Ligand
BDBM50375144
Substrate
Meas. Tech.
ChEMBL_470263 (CHEMBL950218)
IC50
8±n/a nM
Citation
 Huang, HHutta, DAHu, HDesJarlais, RLSchubert, CPetrounia, IPChaikin, MAManthey, CLPlayer, MR Design and synthesis of a pyrido[2,3-d]pyrimidin-5-one class of anti-inflammatory FMS inhibitors. Bioorg Med Chem Lett 18:2355-61 (2008)  
Target
Name:
Macrophage colony-stimulating factor 1 receptor
Synonyms:
CSF1R FMS Macrophage colony stimulating factor receptor Macrophage colony-stimulating factor 1 receptor (c-FMS) Proto-oncogene c-Fms c-fms | cFMS
Type:
Protein
Mol. Mass.:
107979.48
Organism:
Homo sapiens (Human)
Description:
P07333
Residue:
972
  
Inhibitor
Name:
BDBM50375144
Synonyms:
CHEMBL255584
Type:
Small organic molecule
Emp. Form.:
C28H29N7O2
Mol. Mass.:
495.5756
SMILES:
CN1CCN(CC1)c1cccc(Nc2ncc3c(n2)n(cc(C(N)=O)c3=O)-c2ccc3CCCc3c2)c1
: