Target
G-protein coupled bile acid receptor 1
Ligand
BDBM50223368
Substrate
Meas. Tech.
ChEMBL_472949 (CHEMBL949256)
EC50
3330±n/a nM
Citation
 Sato, HMacchiarulo, AThomas, CGioiello, AUne, MHofmann, AFSaladin, RSchoonjans, KPellicciari, RAuwerx, J Novel potent and selective bile acid derivatives as TGR5 agonists: biological screening, structure-activity relationships, and molecular modeling studies. J Med Chem 51:1831-41 (2008)  
Target
Name:
G-protein coupled bile acid receptor 1
Synonyms:
BG37 GPBAR_HUMAN TGR5 hGPCR19
Type:
G Protein-Coupled Receptor (GPCR)
Mol. Mass.:
35260.02
Organism:
Homo sapiens (Human)
Description:
CHO cells transiently transfected with hTGR5.
Residue:
330
  
Inhibitor
Name:
BDBM50223368
Synonyms:
3beta-hydroxyandrost-5-en-17-one DHEAS Prasterone
Type:
Small organic molecule
Emp. Form.:
C19H28O2
Mol. Mass.:
288.4244
SMILES:
C[C@]12CC[C@H]3[C@@H](CC=C4C[C@@H](O)CC[C@]34C)[C@@H]1CCC2=O
: