Target
Mu-type opioid receptor
Ligand
BDBM50375694
Substrate
Meas. Tech.
ChEMBL_473939 (CHEMBL950319)
Ki
41.2±n/a nM
Citation
 Ryu, EKWu, ZChen, KLazarus, LHMarczak, EDSasaki, YAmbo, ASalvadori, SRen, CZhao, HBalboni, GChen, X Synthesis of a potent and selective (18)F-labeled delta-opioid receptor antagonist derived from the Dmt-Tic pharmacophore for positron emission tomography imaging. J Med Chem 51:1817-23 (2008)  
Target
Name:
Mu-type opioid receptor
Synonyms:
MOR-1 Mu-type opioid receptor (MOR) OPRM_RAT Opioid receptor B Ror-b
Type:
G Protein-Coupled Receptor (GPCR)
Mol. Mass.:
44503.11
Organism:
Rattus norvegicus (rat)
Description:
Competition binding assays were carried out using membrane preparations from transfected HN9.10 cells that constitutively expressed the mu opioid receptor.
Residue:
398
  
Inhibitor
Name:
BDBM50375694
Synonyms:
CHEMBL244265
Type:
Small organic molecule
Emp. Form.:
C34H39FN4O6
Mol. Mass.:
618.6951
SMILES:
Cc1cc(O)cc(C)c1C[C@H](N)C(=O)N1Cc2ccccc2C[C@@H]1C(=O)NCCCC[C@H](NC(=O)c1ccc(F)cc1)C(O)=O
: