Target
Geranylgeranyl pyrophosphate synthase
Ligand
BDBM25288
Substrate
Meas. Tech.
ChEMBL_474167 (CHEMBL938425)
IC50
4000±n/a nM
Citation
 Guo, RTCao, RLiang, PHKo, TPChang, THHudock, MPJeng, WYChen, CKZhang, YSong, YKuo, CJYin, FOldfield, EWang, AH Bisphosphonates target multiple sites in both cis- and trans-prenyltransferases. Proc Natl Acad Sci U S A 104:10022-7 (2007)  
Target
Name:
Geranylgeranyl pyrophosphate synthase
Synonyms:
Dimethylallyltranstransferase GGPP synthetase GGPPSase Geranylgeranyl Diphosphate Synthase (GGPPS) Geranylgeranyl pyrophosphate synthetase | Geranyltranstransferase
Type:
Homooctamer; transferase
Mol. Mass.:
34867.94
Organism:
Homo sapiens (Human)
Description:
Recombinant human GGPPS was cloned and expressed in E. coli.
Residue:
300
  
Inhibitor
Name:
BDBM25288
Synonyms:
BPH-629 bisphosphonate, 8
Type:
Small organic molecule
Emp. Form.:
C20H18O8P2
Mol. Mass.:
448.2996
SMILES:
OC(Cc1cccc(c1)-c1cccc2c1oc1ccccc21)(P(O)(O)=O)P(O)(O)=O
: