Target
Adenosylhomocysteinase
Ligand
BDBM50135288
Substrate
Meas. Tech.
ChEMBL_476996 (CHEMBL937500)
IC50
3100±n/a nM
Citation
 Ando, TKojima, KChahota, PKozaki, AMilind, NDKitade, Y Synthesis of 4'-modified noraristeromycins to clarify the effect of the 4'-hydroxyl groups for inhibitory activity against S-adenosyl-L-homocysteine hydrolase. Bioorg Med Chem Lett 18:2615-8 (2008)  
Target
Name:
Adenosylhomocysteinase
Synonyms:
AHCY SAHH | SAHH_HUMAN
Type:
PROTEIN
Mol. Mass.:
47714.06
Organism:
Homo sapiens (Human)
Description:
ChEMBL_1507791
Residue:
432
  
Inhibitor
Name:
BDBM50135288
Synonyms:
(1S,2R,3S,4R)-4-(6-Amino-purin-9-yl)-cyclopentane-1,2,3-triol CHEMBL129014 | NORARISTEROMYCIN
Type:
Small organic molecule
Emp. Form.:
C10H13N5O3
Mol. Mass.:
251.2419
SMILES:
Nc1ncnc2n(cnc12)[C@@H]1C[C@H](O)[C@@H](O)[C@H]1O
: