Target
Kappa-type opioid receptor
Ligand
BDBM50376848
Substrate
Meas. Tech.
ChEMBL_477932 (CHEMBL935623)
Ki
570±n/a nM
Citation
 Tidgewell, KGroer, CEHarding, WWLozama, ASchmidt, MMarquam, AHiemstra, JPartilla, JSDersch, CMRothman, RBBohn, LMPrisinzano, TE Herkinorin analogues with differential beta-arrestin-2 interactions. J Med Chem 51:2421-31 (2008)  
Target
Name:
Kappa-type opioid receptor
Synonyms:
K-OR-1 Kappa-opioid receptor (KOR) Kappa-type opioid receptor (KOR) OPIATE Kappa OPRK1 kappa opioid receptor (KOR)
Type:
G Protein-Coupled Receptor (GPCR)
Mol. Mass.:
42648.76
Organism:
Homo sapiens (Human)
Description:
P41145
Residue:
380
  
Inhibitor
Name:
BDBM50376848
Synonyms:
CHEMBL265195
Type:
Small organic molecule
Emp. Form.:
C28H29NO10
Mol. Mass.:
539.5306
SMILES:
COC(=O)[C@@H]1C[C@H](OC(=O)c2ccc(cc2)[N+]([O-])=O)C(=O)[C@H]2[C@@]1(C)CC[C@H]1C(=O)O[C@@H](C[C@]21C)c1ccoc1
: