Target
Carbonic anhydrase 1
Ligand
BDBM26197
Substrate
Meas. Tech.
ChEMBL_479317 (CHEMBL933689)
Ki
10000±n/a nM
Citation
 Innocenti, AHilvo, MScozzafava, AParkkila, SSupuran, CT Carbonic anhydrase inhibitors: Inhibition of the new membrane-associated isoform XV with phenols. Bioorg Med Chem Lett 18:3593-6 (2008)  
Target
Name:
Carbonic anhydrase 1
Synonyms:
CA-I CAB Carbonate dehydratase I Carbonic anhydrase 1 (CA I) Carbonic anhydrase 1 (Recombinant CA I) Carbonic anhydrase B Carbonic anhydrase I (CA I) Carbonic anhydrase I (CAI) Carbonic anhydrase isoenzyme I (hCA I) | hCA
Type:
Enzyme
Mol. Mass.:
28873.37
Organism:
Homo sapiens (Human)
Description:
P00915
Residue:
261
  
Inhibitor
Name:
BDBM26197
Synonyms:
CHEMBL112 Norco US9333197, Acetaminophen phenol derivative, 11
Type:
Small organic molecule
Emp. Form.:
C8H9NO2
Mol. Mass.:
151.1626
SMILES:
CC(=O)Nc1ccc(O)cc1
: