Target
Progesterone receptor
Ligand
BDBM50377345
Substrate
Meas. Tech.
ChEMBL_479541 (CHEMBL931537)
Ki
22±n/a nM
Citation
 Roach, SLHiguchi, RIAdams, MELiu, YKaranewsky, DSMarschke, KBMais, DEMiner, JNZhi, L Discovery of nonsteroidal glucocorticoid receptor ligands based on 6-indole-1,2,3,4-tetrahydroquinolines. Bioorg Med Chem Lett 18:3504-8 (2008)  
Target
Name:
Progesterone receptor
Synonyms:
NR3C3 PGR PRGR_HUMAN | progesterone
Type:
Protein
Mol. Mass.:
98979.52
Organism:
Homo sapiens (Human)
Description:
P06401
Residue:
933
  
Inhibitor
Name:
BDBM50377345
Synonyms:
CHEMBL256787
Type:
Small organic molecule
Emp. Form.:
C22H25ClN2
Mol. Mass.:
352.9
SMILES:
CC1CC(C)(C)Nc2c(C)cc(c(Cl)c12)-c1cccc2c(C)c[nH]c12
: