Target
Adenosine receptor A1
Ligand
BDBM50163025
Substrate
Meas. Tech.
ChEMBL_479905 (CHEMBL935758)
Ki
270±n/a nM
Citation
 Melman, AGao, ZGKumar, DWan, TCGizewski, EAuchampach, JAJacobson, KA Design of (N)-methanocarba adenosine 5'-uronamides as species-independent A3 receptor-selective agonists. Bioorg Med Chem Lett 18:2813-9 (2008)  
Target
Name:
Adenosine receptor A1
Synonyms:
A1 adenosine receptor (hA1) AA1R_HUMAN ADORA1 Adenosine A1-receptor Adenosine receptor A1 (hA1) | Adenosine transporter (AdT)
Type:
G Protein-Coupled Receptor (GPCR)
Mol. Mass.:
36520.92
Organism:
Homo sapiens (Human)
Description:
P30542
Residue:
326
  
Inhibitor
Name:
BDBM50163025
Synonyms:
(1S,2R,3S,4R,5S)-4-(6-(3-bromobenzylamino)-2-chloro-9H-purin-9-yl)-2,3-dihydroxy-N-methylbicyclo[3.1.0]hexane-1-carboxamide CHEMBL425741
Type:
Small organic molecule
Emp. Form.:
C20H20BrClN6O3
Mol. Mass.:
507.768
SMILES:
CNC(=O)[C@]12C[C@@H]1[C@H]([C@H](O)[C@@H]2O)n1cnc2c(NCc3cccc(Br)c3)nc(Cl)nc12
: