Target
Adenosine receptor A3
Ligand
BDBM50377681
Substrate
Meas. Tech.
ChEMBL_479904 (CHEMBL935757)
Ki
4.7±n/a nM
Citation
 Melman, AGao, ZGKumar, DWan, TCGizewski, EAuchampach, JAJacobson, KA Design of (N)-methanocarba adenosine 5'-uronamides as species-independent A3 receptor-selective agonists. Bioorg Med Chem Lett 18:2813-9 (2008)  
Target
Name:
Adenosine receptor A3
Synonyms:
A3AR Adenosine A3 receptor Gpcr2
Type:
PROTEIN
Mol. Mass.:
36460.91
Organism:
Mus musculus
Description:
ChEMBL_1515686
Residue:
319
  
Inhibitor
Name:
BDBM50377681
Synonyms:
CHEMBL257573
Type:
Small organic molecule
Emp. Form.:
C30H35ClN8O5
Mol. Mass.:
623.103
SMILES:
CNC(=O)[C@@]12C[C@@H]1[C@H]([C@H](O)[C@@H]2O)n1cnc2c(NCc3cccc(c3)C#CCCCC(=O)NCCNC(C)=O)nc(Cl)nc12
: